{"text_format":"1","workbook":"xlsx","n_sheets":26,"sheets":["Disclaimer","LDCcomments","Definitions","General Input","Checklist","Host Organization Goals","Budget","Goals","Decision Makers","System","Policies","EM Team","EMP","QR","Utility Data","Dashboard","Executive Summary","Baseline Model","Project Business Case","ExecSummaryCalculation","Non-Incented Template","DropDownLists","Revision Note","LDCs","Input Data","Version Log"],"not_rendered":{"charts":11,"images":0,"macros":1,"external_links":0,"defined_names":94,"comments":1,"pivot_tables":2},"unopened":[],"bounds":{"document_bytes":16777216,"sheet_cells":100000,"rows_first":2000,"rows_last":500,"rows_between":2000,"halvings":0,"cell_chars":16384,"cell_head_chars":4096},"cells_cut":0,"cells_raw":0,"read":"whole","date_system":"1900"}

{"sheet":"Disclaimer","index":0,"n_rows":0,"n_cols":0,"rows_kept":0,"cut":false,"hidden":false,"merged":[]}

{"sheet":"LDCcomments","index":1,"n_rows":40,"n_cols":7,"rows_kept":40,"cut":false,"hidden":true,"merged":[]}
["Originator","EMP Template","Issues/Items Requiring Clarification => Version 2.1?","Guide","EM Support Services","Action Items","Status"]
["Kyle Ohearn","First Principles for EM plan;\nMust be Useful to the EMs and their companies\nNot a bible/book\nNo plan element is mandatory\nPhase 1 plan should be considered the first 6 month plan with Year 2 and 3 plans updated/ continually improved\nPlan to document yearly kW and kWh targets \nPlan to pull project title, kW & kWh savings, cost from QR’s (make sure QR has appropriate fields for EM plan tab)\nUse non energy language for CFO and other executive audience\nFormatted to be a good printable executive document\n","All addressed or in progress "]
["Kyle Ohearn","Executive Summary\n- Energy Efficiency Targets\no Year 1 Target \n kW and kWh\no Year 2 Target \n kW and kWh\no Year 3 Target\n kW and KWh","Addressed"]
["Kyle Ohearn","Check list questions: \n\nWho are the executive approvers ? \nDo you have the utility account numbers, utility contact names, utility data, other meter information ? links?\nWhat are the corporate hurdle rates for capital projects?  NPV? Simple payback, IRR?, etc??","Incorporated but in slightly different format per Kyle's direction"]
["Kyle Ohearn","Energy Management Goals (policy, targets, goals)\nDoes your corporation have an Energy Savings plan/policy/ Sustainability plan/policy. If Yes,  Link to policy or copy into an appendix tab?\n\nDo the corporate plans have identified SMARTER metrics/ goals? (SMARTER plan/policies ? => specific (kW, kWh?, measurable, attainable, relevant, time-bound, evaluate, re-evaluate)\nDoes your company have Energy dashboards for executives? If yes link what do they look like\nDo you have procurement rules for energy saving equipment? : rephrase as a question about energy procurement policies?","Somewhat addressed per Kyle's direction"]
["Kyle Ohearn","Energy Management Team (accountability)\n- List Executive/Management Sponsor\n- List Energy Champion\n- Other team members\n- Meeting schedule \n- Meeting agenda","Addressed"]
{"$rows_left_out":35}
{"sheet":"Definitions","index":2,"n_rows":32,"n_cols":19,"rows_kept":32,"cut":false,"hidden":false,"merged":[[5,0,6,0]]}
[]
[]
["Version 1.1"]
["Project Status"]
["Inactive:","Project has been canceled or abandoned."]
["Investigation Stage:","Project has been identified but has not yet been started. No binding commitment has not been made (i.e. Purchase Order not issued)."]
{"$rows_left_out":27}
{"sheet":"General Input","index":3,"n_rows":42,"n_cols":9,"rows_kept":42,"cut":false,"hidden":false,"merged":[[11,0,11,4],[37,0,37,4],[11,8,11,9],[38,0,38,5],[10,6,10,9],[22,6,22,9],[23,6,23,9],[13,8,13,9],[14,8,14,9],[15,8,15,9],[21,6,21,9],[17,8,17,9],[16,8,16,9],[10,0,10,4],[12,2,12,4],[13,2,13,4],[14,2,14,4],[15,2,15,4],[22,2,22,4],[23,2,23,4],[24,2,24,4],[16,2,16,4],[17,2,17,4],[21,0,21,4],[24,6,25,9],[25,2,25,4],[28,2,28,4],[34,2,34,4],[35,2,35,4],[29,2,29,4],[30,2,30,4],[31,2,31,4],[32,2,32,4],[33,2,33,4],[27,0,27,4]]}
[]
[]
["This tab is designed to collect information that is used throughout the workbook to avoid data entry repetition. "]
["All information is treated as confidential. "]
[]
[]
{"$rows_left_out":37}
{"sheet":"Checklist","index":4,"n_rows":14,"n_cols":8,"rows_kept":14,"cut":false,"hidden":false,"merged":[[2,0,2,4],[7,6,7,9],[8,6,8,9],[2,6,2,9],[3,6,4,9],[6,6,6,9],[5,6,5,9]]}
["Definitions","General Input","Checklist","EMP","QR","Utility Data","EM Dashboard","Executive Summary"]
[]
["Energy Manager Checklist",null,null,null,null,null,"Tips"]
[null,null,null,null,null,null,"1) You are required to complete the CEM course by the end of your first term, unless you are already a CEM."]
[null,"I have completed the Certified Energy Manager (CEM) course in my first term"]
[null,{"$f":"\"Your first term end date is: \"&TEXT(DATE(YEAR('General Input'!$C$19)+1,MONTH('General Input'!$C$19),DAY('General Input'!$C$19)),\"mm/dd/yyyy\")","v":"Your first term end date is: 01/01/2017"},null,null,null,null,"CIET CEM Course Information"]
{"$rows_left_out":9}
{"sheet":"Host Organization Goals","index":5,"n_rows":21,"n_cols":11,"rows_kept":21,"cut":false,"hidden":true,"merged":[[20,8,21,10],[17,8,18,10],[12,8,13,10],[2,0,2,6],[3,8,3,10],[4,8,5,10],[7,8,8,10],[9,8,10,10],[11,8,11,10],[16,1,16,5]]}
[]
[]
["Host Organization Details & Goals"]
[null,null,null,null,null,null,null,null,"Tips"]
["Provide your Organization's/Facility's Annual Electricity Consumption & Savings Targets",null,null,null,null,null,null,null,"1) Obtain your Facility/Facilities Electricity Consumption Data"]
[]
{"$rows_left_out":16}
{"sheet":"Budget","index":6,"n_rows":22,"n_cols":9,"rows_kept":22,"cut":false,"hidden":true,"merged":[[19,0,19,1],[20,0,20,1],[21,0,21,1],[11,8,12,10],[17,8,18,10],[17,0,17,1],[18,0,18,1],[2,0,2,6],[3,8,3,10],[5,8,6,10],[15,8,16,10],[7,8,10,10]]}
[]
[]
["Organization Budget"]
[null,null,null,null,null,null,null,null,"Tips"]
["Determine your Organization's Annual CAPEX and Operating & Maintenance Budgets",null,null,null,null,null,null,null,"2) Energy Efficiency Budgets"]
[null,null,null,null,null,null,null,null,"Discussing with management the potential for an annual budget for energy efficiency projects. Leverage your Energy Policy, if one exists."]
{"$rows_left_out":17}
{"sheet":"Goals","index":7,"n_rows":21,"n_cols":11,"rows_kept":21,"cut":false,"hidden":true,"merged":[[10,0,10,1],[10,8,10,9],[2,0,2,6],[3,8,3,10],[4,8,5,10],[6,0,6,1],[6,8,6,10],[7,0,7,1],[7,8,7,9],[8,0,8,1],[8,8,8,9],[9,0,9,1],[9,8,9,9],[16,0,16,1],[23,8,24,10],[17,0,17,1],[11,0,11,1],[14,8,14,9],[12,0,12,1],[13,0,13,1],[20,8,22,10],[15,0,15,1],[15,8,15,9],[16,8,16,9],[17,8,17,9],[18,8,18,9],[11,8,11,9],[12,8,12,9]]}
[]
[]
["Energy Manager Goals & Results"]
[null,null,null,null,null,null,null,null,"Tips"]
["Provide your Annual Savings Target",null,null,null,null,null,null,null,"4) Know your organization's hurdle rates and financial metrics used to evaluate Energy Efficiency Projects"]
[]
{"$rows_left_out":16}
{"sheet":"Decision Makers","index":8,"n_rows":21,"n_cols":9,"rows_kept":21,"cut":false,"hidden":true,"merged":[[2,0,2,6],[3,8,3,10]]}
[]
[]
["Decision Makers"]
[null,null,null,null,null,null,null,null,"Tips"]
["Determine the Project Decision-makers at your Organization?"]
["Capital Projects"]
{"$rows_left_out":16}
{"sheet":"System","index":9,"n_rows":20,"n_cols":17,"rows_kept":20,"cut":false,"hidden":true,"merged":[[13,16,14,18],[7,16,8,18],[15,16,15,18],[2,0,2,14],[2,16,2,18],[4,16,6,18],[9,16,10,18],[11,16,12,18]]}
[]
[]
["Identify Major Energy Users/Systems at your Facility/Facilities",null,null,null,null,null,null,null,null,null,null,null,null,null,null,null,"Tips"]
[null,null,null,null,null,null,null,null,null,null,null,null,null,null,null,null,"6) Identifying Large Energy Users"]
[null,null,null,null,null,null,null,null,null,null,null,null,null,null,null,null,"Identify largest energy use systems/equipment by consulting your equipment/motor list or obtaining available sub-metered supporting data."]
[]
{"$rows_left_out":15}
{"sheet":"Policies","index":10,"n_rows":18,"n_cols":4,"rows_kept":18,"cut":false,"hidden":true,"merged":[[11,3,13,5],[14,3,15,5],[2,0,2,1],[3,3,3,5],[5,3,7,5],[8,3,10,5]]}
[]
[]
["Energy Policy"]
[null,null,null,"Tips"]
["Identify your Organisation's Energy Policy",null,null,"8) Creating an Energy Policy"]
[null,null,null,"If an Energy Policy does not exist at your organization, consider creating an Energy Policy with your Annual Savings Target as the goal."]
{"$rows_left_out":13}
{"sheet":"EM Team","index":11,"n_rows":12,"n_cols":7,"rows_kept":12,"cut":false,"hidden":true,"merged":[[10,6,11,8],[2,0,2,4],[3,6,3,8],[5,6,5,8],[6,6,6,8],[7,6,8,8]]}
[]
[]
["Energy Management Team"]
[null,null,null,null,null,null,"Tips"]
["Identify or Create your Energy Management Team"]
["Position","Name","Role","Telephone Number","Email",null,"9) Create and Energy Team with an executive sponsor"]
{"$rows_left_out":7}
{"sheet":"EMP","index":12,"n_rows":65,"n_cols":8,"rows_kept":65,"cut":false,"hidden":false,"merged":[[8,1,8,4],[2,0,2,9],[8,6,8,9],[26,0,26,8],[9,2,9,3]]}
["Definitions","General Input","Checklist","EMP","QR","Utility Data","Dashboard","Executive Summary"]
[]
["Energy Management Plan (EMP)"]
[]
[]
[]
{"$rows_left_out":60}
{"sheet":"QR","index":13,"n_rows":9,"n_cols":39,"rows_kept":9,"cut":false,"hidden":false,"merged":[]}
[]
[{"$f":"'General Input'!$C$29","v":"XYZ Industries Inc."},null,null,null,{"$f":"'General Input'!$C$13","v":"John Smith"}]
["LDC Reviewed","Chart","Energy Manager Name","Type","NAICS","Sector","Project Participant","Facility Name","Utility","Measure Address","City","Measure Postal Code","Incentive Type","Incentive Program","Project Title","Project Description","Additional Comments","Measure Term","Application Number","Project Cost","Capital Incentive","Estimated Peak Demand Savings (kW)","Estimated Electricity Savings (MWh)","Estimated Completion Date","Actual Peak Demand Savings (kW)","Actual Electricity Savings (MWh)","Project Payback (Yr)","In Service Date","Project Status","Measure Type","Technology","Technical Reviewer Comments","Energy Manager Comments","Framework","Natural Gas Savings","Water Savings","Other Benefits ($)","Year of Completion","Annual $ Savings"]
[null,null,null,null,null,null,null,null,null,null,null,null,null,null,null,null,null,null,null,null,null,null,null,null,null,null,null,null,null,null,null,null,null,null,null,null,null,{"$f":"IF(QRTable[[#This Row],[In Service Date]]=\"\",\"\",YEAR(QRTable[[#This Row],[In Service Date]]))","v":""},{"$f":"QRTable[[#This Row],[Estimated Electricity Savings (MWh)]]*'Host Organization Goals'!$K$15","v":0}]
[null,null,null,null,null,null,null,null,null,null,null,null,null,null,null,null,null,null,null,null,null,null,null,null,null,null,null,null,null,null,null,null,null,null,null,null,null,{"$f":"IF(QRTable[[#This Row],[In Service Date]]=\"\",\"\",YEAR(QRTable[[#This Row],[In Service Date]]))","v":""},{"$f":"QRTable[[#This Row],[Estimated Electricity Savings (MWh)]]*'Host Organization Goals'!$K$15","v":0}]
[null,null,null,null,null,null,null,null,null,null,null,null,null,null,null,null,null,null,null,null,null,null,null,null,null,null,null,null,null,null,null,null,null,null,null,null,null,{"$f":"IF(QRTable[[#This Row],[In Service Date]]=\"\",\"\",YEAR(QRTable[[#This Row],[In Service Date]]))","v":""},{"$f":"QRTable[[#This Row],[Estimated Electricity Savings (MWh)]]*'Host Organization Goals'!$K$15","v":0}]
{"$rows_left_out":4}
{"sheet":"Utility Data","index":14,"n_rows":26,"n_cols":14,"rows_kept":26,"cut":false,"hidden":false,"merged":[]}
[]
[]
[]
[]
[]
[]
{"$rows_left_out":21}
{"sheet":"Dashboard","index":15,"n_rows":26,"n_cols":17,"rows_kept":26,"cut":false,"hidden":false,"merged":[[15,2,15,3],[17,3,17,6]]}
[]
[]
[]
[]
[]
[]
{"$rows_left_out":21}
{"sheet":"Executive Summary","index":16,"n_rows":65,"n_cols":15,"rows_kept":65,"cut":false,"hidden":false,"merged":[[40,8,41,9],[40,10,41,10],[42,10,43,10],[49,0,49,6],[44,0,44,1],[45,0,45,1],[46,0,46,1],[43,4,43,5],[44,4,44,5],[48,0,48,9],[45,2,45,3],[45,4,45,5],[46,4,46,5],[46,2,46,3],[42,8,43,9],[46,8,46,9],[44,8,45,9],[43,0,43,1],[43,2,43,3],[50,0,50,6],[44,2,44,3],[51,0,51,6],[52,0,52,6],[53,0,53,6],[54,0,54,6],[57,0,57,6],[64,0,64,10],[65,0,69,10],[58,0,58,6],[59,0,59,6],[60,0,60,6],[61,0,61,6],[62,0,62,6],[2,0,2,10],[3,0,3,5],[6,0,11,10],[5,0,5,10],[38,8,39,9],[38,10,39,10],[36,8,37,9],[36,10,37,10],[3,6,3,10],[12,1,12,2],[32,8,32,9],[35,8,35,9],[33,8,34,9],[33,10,34,10],[5,12,5,13],[6,12,6,13],[7,12,7,13],[9,12,9,13],[10,12,10,13]]}
[null,null,null,null,null,null,null,null,null,null,null,null,"Display Charts from",null,"Input Year"]
[]
["ENERGY MANAGER EXECUTIVE SUMMARY",null,null,null,null,null,null,null,null,null,null,null,"Input Year",null,2015]
[{"$f":"\"Organization: \"&'General Input'!$C$29","v":"Organization: XYZ Industries Inc."},null,null,null,null,null,{"$f":"\"Energy Manager: \"&'General Input'!$C$13","v":"Energy Manager: John Smith"},null,null,null,null,null,"Year",null,{"$f":"IF($O$1=\"EM Start Year\",YEAR('General Input'!$C$19),$O$3)","v":2015}]
[]
["Energy Management Highlights",null,null,null,null,null,null,null,null,null,null,null,"Display Equivalent Unit/Production",null,"Yes"]
{"$rows_left_out":60}
{"sheet":"Baseline Model","index":17,"n_rows":1,"n_cols":1,"rows_kept":1,"cut":false,"hidden":true,"merged":[]}
["Placeholder. Phase 2 Item"]

{"sheet":"Project Business Case","index":18,"n_rows":1,"n_cols":1,"rows_kept":1,"cut":false,"hidden":true,"merged":[]}
["Placeholder. Phase 2 Item"]

{"sheet":"ExecSummaryCalculation","index":19,"n_rows":61,"n_cols":20,"rows_kept":61,"cut":false,"hidden":true,"merged":[]}
["This sheet calculates metrics used to display the charts in the Executive Summary report. "]
[]
[]
["Term Savings vs Target Table (#N/A cells allow charts to dynamically display only the years wanted)"]
["Term","$ Savings","Internal Target","Expected Savings in $","$ Savings in Investigation","# Units Sold","Year","Index","Dummy Year"]
[{"$f":"IF(termsavtgttable[[#This Row],[Year]]>YEAR(TODAY()),NA(),termsavtgttable[[#This Row],[Year]]-YEAR('General Input'!$C$19)+1)","v":0},{"$f":"IF(ISNUMBER(termsavtgttable[[#This Row],[Term]]),SUMIFS(QRTable[Annual $ Savings],QRTable[Project Status],\"Completed\",QRTable[Incentive Program],\"<>*PES\",QRTable[Incentive Program],\"<>*DES\",QRTable[In Service Date],\"<=\"&termsavtgttable[[#This Row],[Dummy Year]]),NA())","v":0},{"$f":"IF(ISNUMBER(termsavtgttable[[#This Row],[Term]]),SUMIF('Host Organization Goals'!$A$8:$A$14,\"<=\"&termsavtgttable[Year],'Host Organization Goals'!$G$8:$G$14))","v":0},{"$f":"IF(ISNUMBER(termsavtgttable[[#This Row],[Term]]),SUMIFS(QRTable[Annual $ Savings],QRTable[Project Status],\"=Underway\",QRTable[Incentive Program],\"<>*PES\",QRTable[Incentive Program],\"<>*DES\",QRTable[Estimated Completion Date],\"<=\"&termsavtgttable[[#This Row],[Dummy Year]]),NA())","v":0},{"$f":"IF(ISNUMBER(termsavtgttable[[#This Row],[Term]]),SUMIFS(QRTable[Annual $ Savings],QRTable[Project Status],\"=Investigation Stage\",QRTable[Incentive Program],\"<>*PES\",QRTable[Incentive Program],\"<>*DES\",QRTable[Estimated Completion Date],\"<=\"&termsavtgttable[[#This Row],[Dummy Year]]),NA())","v":0},{"$f":"termsavtgttable[[#This Row],[$ Savings]]/'Executive Summary'!$O$8","v":0},{"$f":"IF('Host Organization Goals'!$A$8+termsavtgttable[[#This Row],[Index]]-1<=YEAR(TODAY()),'Executive Summary'!$O$4+termsavtgttable[[#This Row],[Index]]-1,NA())","v":2015},1,{"$f":"DATE(termsavtgttable[[#This Row],[Year]],12,31)","v":42369}]
{"$rows_left_out":56}
{"sheet":"Non-Incented Template","index":20,"n_rows":17,"n_cols":2,"rows_kept":17,"cut":false,"hidden":false,"merged":[[16,0,16,1]]}
["Program Enabled Savings Claim Template – Project"]
["*Copy this table to columns to the right to expand"]
["Project Contact (name)","Insert name"]
["Project Location – Address","Insert address."]
["Phone No.","xxx-xxx-xxxx"]
["Email Address","name@company.com"]
{"$rows_left_out":12}
{"sheet":"DropDownLists","index":21,"n_rows":26,"n_cols":10,"rows_kept":26,"cut":false,"hidden":true,"merged":[]}
["Performance Based"]
["Salary Based",1,"Incented",null,null,null,null,1]
[null,2,"Non-Incented",null,"Completed",null,null,2]
["Single",3,null,null,"Underway",null,null,3]
["Multi-Site",4,null,null,"Investigation Stage",null,null,4]
[null,null,null,null,"Inactive"]
{"$rows_left_out":21}
{"sheet":"Revision Note","index":22,"n_rows":7,"n_cols":3,"rows_kept":7,"cut":false,"hidden":true,"merged":[]}
["Rev","Note","Date"]
[0,"• Completion Date column has a conditional formatting with red font or background when:\no Completion date is past today yet status is Complete\no Completion date is prior to today’s date while the status is NOT Complete\no Completion date is earlier than EM start date\no MWh is greater than 10,000 MWh as a warning\no MWh or kW value is NOT a numeric value (i.e. actually typing in ‘500 MWh’ will flag it)\n• Guide comments per column changed to text box, such that it extends/shrinks with the column width. Prior to this, comment box remained in the same place regardless of what happened.\n• Changed the ‘Example’ columns to ‘Additional’ columns with added description ‘EMs may include, but will not be imported into the database’\n• Added ‘Retrofit – Program’ under Application Type column to prevent compatibility issues with old templates\n","2014-09-05"]
[0.1,"More conditional formatting added for 'Completed' status without a date\nID column added to keep track of projects\nRevision note tab added","2014-10-16"]
[0.2,"Technical Reviewer comment column added","2014-10-22"]
[1,"Revised the version date in the intro sheet","2014-10-31"]
[1.1000000000000001,"Revised a spelling error in the definition tab\nRevision Note tab hidden\nApplication Type 'Retrofit - Program' revised to 'Retrofit Program'","2014-11-07"]
{"$rows_left_out":2}
{"sheet":"LDCs","index":23,"n_rows":80,"n_cols":1,"rows_kept":80,"cut":false,"hidden":true,"merged":[]}
["LDCs"]
["Algoma Power Inc."]
["Atikokan Hydro Inc."]
["Attawapiskat First Nation"]
["Attawapiskat Power Corporation"]
["Bluewater Power Distribution Corporation"]
{"$rows_left_out":75}
{"sheet":"Input Data","index":24,"n_rows":36,"n_cols":10,"rows_kept":36,"cut":false,"hidden":true,"merged":[[0,0,0,10],[7,7,7,8],[5,1,6,1],[5,2,6,2],[9,7,9,8],[8,7,8,8],[7,4,8,4],[7,5,8,5],[5,7,5,8],[6,7,6,8],[1,0,2,10]]}
["ENERGY MANAGER EXECUTIVE SUMMARY INPUT FORM"]
["Disclaimer: Executive Summary results are based on information entered into the Quarterly Report and the Executive Summary input tab, and are subject to all limitations, assumptions, and qualifications contained herein. In addition, financial or other projections contained herein are based upon assumptions and entries made by the Energy Manager."]
[]
[null,"Input cells","Calculated values"]
[]
[null,"Blended Electricity Rate ($/MWh)",100,null,"Type of Facility Load:","Fixed",null,"Display Equivalent Unit/Production",null,"No"]
{"$rows_left_out":31}
{"sheet":"Version Log","index":25,"n_rows":8,"n_cols":3,"rows_kept":8,"cut":false,"hidden":true,"merged":[]}
["Version","Changes","Date"]
[0.1,"Initial draft","2016-05-20"]
[0.2,"Review with the stakeholders. Restructuring of the blueprint","2016-05-24"]
[0.3,"Final blueprint draft before the Regional Meetings. Introduction page, EMP revisions, utility data tab revisions","2016-05-26"]
[0.4,"Revised overall structure of the document as per meeting with the stakeholders.\nChanges to the input tab into three different sections.\nAddition of EM Checklist\nTip panel in the EMP blueprint\nRemoval of action items","2016-05-30"]
["Beta",null,"2016-07-14"]
{"$rows_left_out":2}