{"text_format":"1","workbook":"xlsx","n_sheets":10,"sheets":["Preliminary App Worksheet","Final App Worksheet","Participant Agreement","Schedule A - Defined Terms","Schedule B - Eligibility","Measure Assumptions","Version Control","Program Activity Information","Program Activity Measures EE","Dropdown List"],"not_rendered":{"charts":0,"images":2,"macros":1,"external_links":2,"defined_names":17,"comments":0,"pivot_tables":0},"unopened":[],"bounds":{"document_bytes":16777216,"sheet_cells":100000,"rows_first":2000,"rows_last":500,"rows_between":2000,"halvings":0,"cell_chars":16384,"cell_head_chars":4096},"cells_cut":0,"cells_raw":0,"read":"whole","date_system":"1900"}

{"sheet":"Preliminary App Worksheet","index":0,"n_rows":59,"n_cols":14,"rows_kept":59,"cut":false,"hidden":false,"merged":[[8,5,8,11],[13,1,13,3],[19,1,19,2],[9,9,9,11],[9,5,9,8],[10,5,10,8],[11,5,11,8],[12,5,12,8],[10,9,10,11],[14,5,19,11],[12,9,12,11],[15,1,15,3],[16,1,16,3],[17,1,17,3],[6,9,6,11],[11,9,11,11],[23,1,23,3],[24,1,24,3],[26,1,26,3],[18,1,18,3],[20,1,20,3],[21,1,21,3],[22,1,22,3],[8,1,8,3],[9,1,9,3],[6,5,6,6],[10,1,10,3],[11,1,11,3],[12,1,12,3],[14,1,14,3],[25,7,25,11],[25,5,25,6],[25,2,25,3],[56,0,56,2],[58,0,58,2],[27,1,27,3],[35,0,35,2],[47,0,47,2]]}
[]
[]
[]
[]
[]
[]
["Residential New Construction Program (RNC) - Preliminary Application Project Worksheet (Aug. 28, 2018)",null,null,null,null,"Date (DD/MM/YYYY):",null,null,"LDC:"]
[]
["Company name (the \"Applicant\"):",null,null,null,null,"Please provide the Energy Advisor contact details for Performance Based and Custom Incentives:"]
["Applicant address (street number and name):",null,null,null,null,"Energy Advisor company name:"]
{"$rows_left_out":50}
{"sheet":"Final App Worksheet","index":1,"n_rows":71,"n_cols":14,"rows_kept":71,"cut":false,"hidden":false,"merged":[[14,5,15,11],[16,5,16,8],[16,9,16,11],[69,6,69,8],[69,10,69,12],[67,6,67,8],[67,10,67,12],[68,6,68,8],[68,10,68,12],[10,1,10,3],[10,9,10,11],[13,1,13,3],[19,1,19,2],[66,6,66,8],[66,10,66,12],[66,2,67,4],[22,1,22,3],[23,1,23,3],[11,1,11,3],[12,1,12,3],[14,1,14,3],[15,1,15,3],[16,1,16,3],[21,1,21,3],[17,1,17,3],[18,1,18,3],[47,0,47,2],[58,0,58,2],[56,0,56,5],[26,1,26,3],[27,1,27,3],[70,10,70,12],[68,0,70,1],[25,2,25,3],[6,5,6,6],[20,1,20,3],[24,1,24,3],[8,5,8,11],[9,5,9,8],[9,9,9,11],[11,9,11,11],[12,9,12,11],[12,5,12,8],[6,9,6,11],[8,1,8,3],[9,1,9,3],[35,0,35,2]]}
[]
[]
[]
[]
[]
[]
["Residential New Construction Program (RNC) - Final Application Project Worksheet (Aug. 28, 2018)",null,null,null,null,"Date (DD/MM/YYYY):",null,null,"LDC:",{"$f":"IF(ISBLANK('Preliminary App Worksheet'!J7),\"\",'Preliminary App Worksheet'!J7)","v":""}]
[]
["Company name (the \"Applicant\"):",{"$f":"IF(ISBLANK('Preliminary App Worksheet'!B9),\"\",'Preliminary App Worksheet'!B9)","v":""},null,null,null,"Please provide the Energy Advisor contact details for Performance Based and Custom Incentives:"]
["Applicant address (street number and name):",{"$f":"IF(ISBLANK('Preliminary App Worksheet'!B10),\"\",'Preliminary App Worksheet'!B10)","v":""},null,null,null,"Energy Advisor company name:",null,null,null,{"$f":"IF(ISBLANK('Preliminary App Worksheet'!J10),\"\",'Preliminary App Worksheet'!J10)","v":""}]
{"$rows_left_out":62}
{"sheet":"Participant Agreement","index":2,"n_rows":76,"n_cols":9,"rows_kept":76,"cut":false,"hidden":false,"merged":[[73,1,73,6],[74,1,74,6],[74,8,74,13],[75,1,75,6],[67,1,67,13],[68,1,68,13],[69,1,69,13],[70,1,70,13],[71,1,71,13],[72,1,72,6],[72,8,72,13],[66,1,66,13],[55,1,55,13],[56,1,56,13],[57,1,57,13],[58,1,58,13],[59,1,59,13],[60,1,60,13],[61,1,61,13],[62,1,62,13],[63,1,63,13],[64,1,64,13],[65,1,65,13],[54,1,54,13],[41,1,41,13],[42,1,42,13],[43,1,43,13],[44,1,44,13],[45,1,45,13],[47,1,47,13],[49,1,49,13],[50,1,50,13],[51,1,51,13],[52,1,52,13],[53,1,53,13],[40,1,40,13],[29,1,29,13],[30,1,30,13],[31,1,31,13],[32,1,32,13],[33,1,33,13],[34,1,34,13],[35,1,35,13],[36,1,36,13],[37,1,37,13],[38,1,38,13],[39,1,39,13],[28,1,28,13],[17,1,17,13],[18,2,18,13],[19,1,19,13],[20,1,20,13],[21,1,21,13],[22,1,22,13],[23,1,23,13],[24,2,24,13],[25,1,25,13],[26,1,26,13],[27,1,27,13],[16,1,16,13],[1,1,1,13],[2,1,2,13],[4,1,4,13],[5,1,5,13],[6,1,6,13],[8,1,8,13],[10,1,10,13],[12,1,12,13],[13,1,13,13],[14,1,14,13],[15,1,15,13]]}
[]
[null,"RESIDENTIAL NEW CONSTRUCTION PROGRAM"]
[null,"PARTICIPANT AGREEMENT"]
[]
[null,"This Participant Agreement is between the Participant (being the “Applicant” in the Application) and the LDC identified in the Application and contains terms and conditions that govern the Save On Energy Residential New Construction Program (“RNC” or the “Program”)."]
[]
[null,"The Participant has submitted an Application to the LDC to participate in the Program and it outlines a proposed Project that would qualify for the Program and Participant Incentives.  If your Application is approved by the LDC, it shall form part of this agreement. "]
[]
[null,"The RNC Program is funded by the Independent Electricity System Operator (\"IESO\"). "]
[]
{"$rows_left_out":67}
{"sheet":"Schedule A - Defined Terms","index":3,"n_rows":69,"n_cols":2,"rows_kept":69,"cut":false,"hidden":false,"merged":[[24,1,24,13],[46,1,46,13],[36,1,36,13],[38,1,38,13],[40,1,40,13],[30,1,30,13],[32,1,32,13],[34,1,34,13],[26,1,26,13],[28,1,28,13],[1,1,1,13],[5,1,5,13],[6,1,6,13],[8,1,8,13],[18,1,18,13],[2,1,2,13],[4,1,4,13],[68,1,68,13],[62,1,62,13],[64,1,64,13],[66,1,66,13],[56,1,56,13],[58,1,58,13],[60,1,60,13],[50,1,50,13],[52,1,52,13],[54,1,54,13],[42,1,42,13],[44,1,44,13],[48,1,48,13],[20,1,20,13],[22,1,22,13],[10,1,10,13],[12,1,12,13],[14,1,14,13],[16,1,16,13]]}
[]
[null,"RESIDENTIAL NEW CONSTRUCTION PROGRAM"]
[null,"SCHEDULE A - DEFINED TERMS"]
[]
[null,"All capitalized terms used but not defined in this Agreement have the meanings given to them in the saveONenergy New Construction Program Rules or the Energy Conservation Agreement between the LDC and the IESO, as applicable. \nThe following terms have the meanings stated below when used in the Agreement:"]
[]
[null,"“Additional Eligibility Criteria” means the requirements set out in Section 1 of Schedule “B” under the heading “Additional Eligibility Criteria”.  "]
[]
[null,"“Agreement” has the meaning given to it on the first page of the Application."]
[]
{"$rows_left_out":60}
{"sheet":"Schedule B - Eligibility","index":4,"n_rows":15,"n_cols":3,"rows_kept":15,"cut":false,"hidden":false,"merged":[[13,1,13,13],[14,2,14,13],[15,1,15,13],[8,1,8,13],[10,1,10,13],[9,1,9,13],[11,1,11,13],[0,1,0,13],[1,1,1,13],[2,1,2,13],[4,1,4,13],[12,2,12,13],[5,1,5,13],[6,1,6,13],[7,1,7,13]]}
[]
[null,"RESIDENTIAL NEW CONSTRUCTION PROGRAM"]
[null,"SCHEDULE B - ELIGIBILITY REQUIREMENTS"]
[]
[null,"1. Additional Eligibility Criteria  "]
[null,"In addition to any other applicable criteria set out in the Application, for the Applicant to be eligible to receive an Incentive under the Initiative:\n(a) no Incentive Payment will have been previously paid to the Applicant for the same specifically-identified Prescriptive Measure(s), Performance Based Measure(s) and/or Custom Measure(s) installed, implemented or undertaken and completed at the same municipal address of the Project, whether through one or more applications; \n(b) the Project will not have received any other benefit, incentive, advantage or payment offered by another IESO-funded program (including discounts from coupons under other residential electricity conservation and demand management program initiatives);  \n(c) all requirements of the LDC with respect to the application process will have been satisfied; \n(d) the Applicant must have submitted to the LDC a Preliminary Application for pre-approval of the proposed Eligible Project that is the subject of such Preliminary Application prior to framing and purchasing, installing or otherwise undertaking and completing such Eligible Measure(s).  \n(e) the Applicant must have submitted the “EnerGuide Energy Efficiency Evaluation Report” or “ENERGY STAR® Qualified New Home Certificate” within six(6) months of the date of submission of the Final Application, and in any event, the Applicant must have submitted such occupancy permit on or before December 31, 2020 and such “EnerGuide Energy Efficiency Evaluation Report” or “ENERGY STAR® Qualified New Home Certificate” (Version 12.7 or later) on or before December 31, 2020;  \n(f) no Eligible Project may have been commenced prior to January 1, 2015; \n(g) the approved Eligible Project must have been installed, implemented or undertaken and completed (i.e., fully installed, implemented or undertaken and completed and ready for service) by December 31, 2020; and\n(h) the Preliminary Application must be submitted to the LDC no later than December 19, 2018, and the submitted Approved Preliminary Application of each Eligible Home Builder will have become an Approved Final Application."]
[]
[null,"2. Home Builder Eligibility Criteria "]
[null,"(a) To be an Eligible Home Builder under the Initiative, the Applicant must be a home builder or renovator, as the case may be..  \n(b) If the Applicant is a corporation, it must also provide a certificate of status. \n(c) If the Applicant is limited liability partnership, it must also provide a copy of its filed limited liability partnership declaration."]
[]
{"$rows_left_out":6}
{"sheet":"Measure Assumptions","index":5,"n_rows":18,"n_cols":5,"rows_kept":18,"cut":false,"hidden":false,"merged":[]}
["Track","Measure","Energy Savings (kWh)","Demand Savings (kW)","Incentive"]
["Performance Based","EnerGuide 83 or 84 homes",1885,8.8999999999999996E-2,500]
["Performance Based","EnerGuide 85 or better homes",3100,0.14699999999999999,1000]
["Performance Based","ENERGY STAR® qualified homes",1885,8.8999999999999996E-2,500]
["Prescriptive","All Off Switch",53,4.0000000000000001E-3,50]
["Prescriptive","ENERGY STAR Qualified Light Fixture - 1 or 2 Sockets",125,4.0000000000000001E-3,3]
["Prescriptive","ENERGY STAR qualified light fixture - 3 or more sockets",251,8.0000000000000002E-3,10]
["Prescriptive","ENERGY STAR qualified recessed lighting",32,1E-3,5]
["Prescriptive","ENERGY STAR qualified under the counter lighting",32,1E-3,5]
["Prescriptive","ENERGY STAR qualified LED",32,1E-3,5]
{"$rows_left_out":9}
{"sheet":"Version Control","index":6,"n_rows":7,"n_cols":2,"rows_kept":7,"cut":false,"hidden":true,"merged":[]}
[]
["Version Number ",4]
["Month","August "]
["Day ",21]
["Year ",2013]
[]
["Make sure to update the version number on the footer as there is no Excel function that can currently do this automatically "]

{"sheet":"Program Activity Information","index":7,"n_rows":2,"n_cols":24,"rows_kept":2,"cut":false,"hidden":true,"merged":[]}
["LDC_Name","Program_Name","Funding_ Mechanism","Application_ID","Company name","Applicant_First_Name","Applicant_Last_Name","Applicant_PrimaryPhone","Applicant_EmailAddress","Application_SubmissionDate\nMM/DD/YYYY","How_did_the_participant_hear_about_this_program? ","Facility_LDC","Rate_Class","Building_Type","Building_Address_Line1","Building_Address_Line2","Building_Address_Line3","Building_Address_City","Building_Address_PostalCode","Project_Start_Date\nMM/DD/YYYY","Project_Completion_Date\nMM/DD/YYYY","Incentive_Amount_Eligible","Reference_Number","Reference_Date\nMM/DD/YYYY"]
[{"$f":"'Final App Worksheet'!$J$7","v":""},"New Construction Program","Full Cost Recovery",null,{"$f":"'Final App Worksheet'!$B$9","v":""},{"$f":"'Final App Worksheet'!$B$13","v":""},{"$f":"'Final App Worksheet'!$B$14","v":""},{"$f":"'Final App Worksheet'!$B$15","v":""},{"$f":"'Final App Worksheet'!$B$16","v":""},{"$f":"'Final App Worksheet'!H7","v":"00:00:00"},null,{"$f":"'Final App Worksheet'!$J$7","v":""},null,null,{"$f":"'Final App Worksheet'!$B$19","v":""},null,null,{"$f":"'Final App Worksheet'!$B$20","v":""},{"$f":"'Final App Worksheet'!$D$20","v":""},{"$f":"'Final App Worksheet'!$B$27","v":"00:00:00"},{"$f":"'Final App Worksheet'!$B$28","v":"00:00:00"},{"$f":"'Final App Worksheet'!$D$59","v":0}]

{"sheet":"Program Activity Measures EE","index":8,"n_rows":20,"n_cols":23,"rows_kept":20,"cut":false,"hidden":true,"merged":[]}
["LDC_Name","Program_Name","Funding_ Mechanism","Application_ID","Facility_LDC","Phase_ID","Measure_Name","Project_Track","Measure_ID","Measure_End_Use_Category","Measure_Type","Measure_Description \n(Custom Only)","Measure_EUL","Number_of_Units","Base_Measure","Project_Completion_Date\nMM/DD/YYYY","Total_Costs_of_Project","Incremental_Equipment_Cost","Gross_Energy_Savings(kWh)","Gross_Demand_Saving","Incentive_Amount","Invoice_Number","Invoice_Date\nMM/DD/YYYY"]
[{"$f":"'Final App Worksheet'!$J$7","v":""},"New Construction Program","Full Cost Recovery",{"$f":"'Final App Worksheet'!$B$18","v":""},{"$f":"'Final App Worksheet'!$J$7","v":""},null,{"$f":"IF(OR('Final App Worksheet'!$C$41<>\"\",'Final App Worksheet'!$C$42<>\"\",'Final App Worksheet'!$C$43<>\"\",'Final App Worksheet'!$C$44<>\"\",'Final App Worksheet'!$C$45<>\"\"),'Final App Worksheet'!$C$39,\"\")","v":""},"Prescriptive",null,null,null,null,null,{"$f":"'Final App Worksheet'!$B$41*'Final App Worksheet'!C41+'Final App Worksheet'!$B$42*'Final App Worksheet'!C42+'Final App Worksheet'!$B$43*'Final App Worksheet'!C43+'Final App Worksheet'!$B$44*'Final App Worksheet'!C44+'Final App Worksheet'!$B$45*'Final App Worksheet'!C45","v":0},null,{"$f":"'Final App Worksheet'!$B$28","v":"00:00:00"},{"$f":"+U2*2","v":0},{"$f":"Q2","v":0},{"$f":"VLOOKUP(G2,'Measure Assumptions'!B:C,2,FALSE)*'Program Activity Measures EE'!N2","v":{"$error":"#N/A"}},{"$f":"VLOOKUP(G2,'Measure Assumptions'!B:D,3,FALSE)*'Program Activity Measures EE'!N2","v":{"$error":"#N/A"}},{"$f":"'Final App Worksheet'!$C$46","v":0}]
[{"$f":"'Final App Worksheet'!$J$7","v":""},"New Construction Program","Full Cost Recovery",{"$f":"'Final App Worksheet'!$B$18","v":""},{"$f":"'Final App Worksheet'!$J$7","v":""},null,{"$f":"IF(OR('Final App Worksheet'!$D$41<>\"\",'Final App Worksheet'!$D$42<>\"\",'Final App Worksheet'!$D$43<>\"\",'Final App Worksheet'!$D$44<>\"\",'Final App Worksheet'!$D$45<>\"\"),'Final App Worksheet'!$D$39,\"\")","v":""},"Prescriptive",null,null,null,null,null,{"$f":"'Final App Worksheet'!$B$41*'Final App Worksheet'!D41+'Final App Worksheet'!$B$42*'Final App Worksheet'!D42+'Final App Worksheet'!$B$43*'Final App Worksheet'!D43+'Final App Worksheet'!$B$44*'Final App Worksheet'!D44+'Final App Worksheet'!$B$45*'Final App Worksheet'!D45","v":0},null,{"$f":"'Final App Worksheet'!$B$28","v":"00:00:00"},{"$f":"+U3*2","v":0},{"$f":"Q3","v":0},{"$f":"VLOOKUP(G3,'Measure Assumptions'!B:C,2,FALSE)*'Program Activity Measures EE'!N3","v":{"$error":"#N/A"}},{"$f":"VLOOKUP(G3,'Measure Assumptions'!B:D,3,FALSE)*'Program Activity Measures EE'!N3","v":{"$error":"#N/A"}},{"$f":"'Final App Worksheet'!$D$46","v":0}]
[{"$f":"'Final App Worksheet'!$J$7","v":""},"New Construction Program","Full Cost Recovery",{"$f":"'Final App Worksheet'!$B$18","v":""},{"$f":"'Final App Worksheet'!$J$7","v":""},null,{"$f":"IF(OR('Final App Worksheet'!$E$41<>\"\",'Final App Worksheet'!$E$42<>\"\",'Final App Worksheet'!$E$43<>\"\",'Final App Worksheet'!$E$44<>\"\",'Final App Worksheet'!$E$45<>\"\"),'Final App Worksheet'!$E$39,\"\")","v":""},"Prescriptive",null,null,null,null,null,{"$f":"'Final App Worksheet'!$B$41*'Final App Worksheet'!E41+'Final App Worksheet'!$B$42*'Final App Worksheet'!E42+'Final App Worksheet'!$B$43*'Final App Worksheet'!E43+'Final App Worksheet'!$B$44*'Final App Worksheet'!E44+'Final App Worksheet'!$B$45*'Final App Worksheet'!E45","v":0},null,{"$f":"'Final App Worksheet'!$B$28","v":"00:00:00"},0,0,{"$f":"VLOOKUP(G4,'Measure Assumptions'!B:C,2,FALSE)*'Program Activity Measures EE'!N4","v":{"$error":"#N/A"}},{"$f":"VLOOKUP(G4,'Measure Assumptions'!B:D,3,FALSE)*'Program Activity Measures EE'!N4","v":{"$error":"#N/A"}},{"$f":"'Final App Worksheet'!$E$46","v":0}]
[{"$f":"'Final App Worksheet'!$J$7","v":""},"New Construction Program","Full Cost Recovery",{"$f":"'Final App Worksheet'!$B$18","v":""},{"$f":"'Final App Worksheet'!$J$7","v":""},null,{"$f":"IF(OR('Final App Worksheet'!$F$41<>\"\",'Final App Worksheet'!$F$42<>\"\",'Final App Worksheet'!$F$43<>\"\",'Final App Worksheet'!$F$44<>\"\",'Final App Worksheet'!$F$45<>\"\"),'Final App Worksheet'!$F$39,\"\")","v":""},"Prescriptive",null,null,null,null,null,{"$f":"'Final App Worksheet'!$B$41*'Final App Worksheet'!F41+'Final App Worksheet'!$B$42*'Final App Worksheet'!F42+'Final App Worksheet'!$B$43*'Final App Worksheet'!F43+'Final App Worksheet'!$B$44*'Final App Worksheet'!F44+'Final App Worksheet'!$B$45*'Final App Worksheet'!F45","v":0},null,{"$f":"'Final App Worksheet'!$B$28","v":"00:00:00"},0,0,{"$f":"VLOOKUP(G5,'Measure Assumptions'!B:C,2,FALSE)*'Program Activity Measures EE'!N5","v":{"$error":"#N/A"}},{"$f":"VLOOKUP(G5,'Measure Assumptions'!B:D,3,FALSE)*'Program Activity Measures EE'!N5","v":{"$error":"#N/A"}},{"$f":"'Final App Worksheet'!$F$46","v":0}]
[{"$f":"'Final App Worksheet'!$J$7","v":""},"New Construction Program","Full Cost Recovery",{"$f":"'Final App Worksheet'!$B$18","v":""},{"$f":"'Final App Worksheet'!$J$7","v":""},null,{"$f":"IF(OR('Final App Worksheet'!$G$41<>\"\",'Final App Worksheet'!$G$42<>\"\",'Final App Worksheet'!$G$43<>\"\",'Final App Worksheet'!$G$44<>\"\",'Final App Worksheet'!$G$45<>\"\"),'Final App Worksheet'!$G$39,\"\")","v":""},"Prescriptive",null,null,null,null,null,{"$f":"'Final App Worksheet'!$B$41*'Final App Worksheet'!G41+'Final App Worksheet'!$B$42*'Final App Worksheet'!G42+'Final App Worksheet'!$B$43*'Final App Worksheet'!G43+'Final App Worksheet'!$B$44*'Final App Worksheet'!G44+'Final App Worksheet'!$B$45*'Final App Worksheet'!G45","v":0},null,{"$f":"'Final App Worksheet'!$B$28","v":"00:00:00"},0,0,{"$f":"VLOOKUP(G6,'Measure Assumptions'!B:C,2,FALSE)*'Program Activity Measures EE'!N6","v":{"$error":"#N/A"}},{"$f":"VLOOKUP(G6,'Measure Assumptions'!B:D,3,FALSE)*'Program Activity Measures EE'!N6","v":{"$error":"#N/A"}},{"$f":"'Final App Worksheet'!$G$46","v":0}]
[{"$f":"'Final App Worksheet'!$J$7","v":""},"New Construction Program","Full Cost Recovery",{"$f":"'Final App Worksheet'!$B$18","v":""},{"$f":"'Final App Worksheet'!$J$7","v":""},null,{"$f":"IF(OR('Final App Worksheet'!$H$41<>\"\",'Final App Worksheet'!$H$42<>\"\",'Final App Worksheet'!$H$43<>\"\",'Final App Worksheet'!$H$44<>\"\",'Final App Worksheet'!$H$45<>\"\"),'Final App Worksheet'!$H$39,\"\")","v":""},"Prescriptive",null,null,null,null,null,{"$f":"'Final App Worksheet'!$B$41*'Final App Worksheet'!H41+'Final App Worksheet'!$B$42*'Final App Worksheet'!H42+'Final App Worksheet'!$B$43*'Final App Worksheet'!H43+'Final App Worksheet'!$B$44*'Final App Worksheet'!H44+'Final App Worksheet'!$B$45*'Final App Worksheet'!H45","v":0},null,{"$f":"'Final App Worksheet'!$B$28","v":"00:00:00"},0,0,{"$f":"VLOOKUP(G7,'Measure Assumptions'!B:C,2,FALSE)*'Program Activity Measures EE'!N7","v":{"$error":"#N/A"}},{"$f":"VLOOKUP(G7,'Measure Assumptions'!B:D,3,FALSE)*'Program Activity Measures EE'!N7","v":{"$error":"#N/A"}},{"$f":"'Final App Worksheet'!$H$46","v":0}]
[{"$f":"'Final App Worksheet'!$J$7","v":""},"New Construction Program","Full Cost Recovery",{"$f":"'Final App Worksheet'!$B$18","v":""},{"$f":"'Final App Worksheet'!$J$7","v":""},null,{"$f":"IF(OR('Final App Worksheet'!$I$41<>\"\",'Final App Worksheet'!$I$42<>\"\",'Final App Worksheet'!$I$43<>\"\",'Final App Worksheet'!$I$44<>\"\",'Final App Worksheet'!$I$45<>\"\"),'Final App Worksheet'!$I$39,\"\")","v":""},"Prescriptive",null,null,null,null,null,{"$f":"'Final App Worksheet'!$B$41*'Final App Worksheet'!I41+'Final App Worksheet'!$B$42*'Final App Worksheet'!I42+'Final App Worksheet'!$B$43*'Final App Worksheet'!I43+'Final App Worksheet'!$B$44*'Final App Worksheet'!I44+'Final App Worksheet'!$B$45*'Final App Worksheet'!I45","v":0},null,{"$f":"'Final App Worksheet'!$B$28","v":"00:00:00"},0,0,{"$f":"VLOOKUP(G8,'Measure Assumptions'!B:C,2,FALSE)*'Program Activity Measures EE'!N8","v":{"$error":"#N/A"}},{"$f":"VLOOKUP(G8,'Measure Assumptions'!B:D,3,FALSE)*'Program Activity Measures EE'!N8","v":{"$error":"#N/A"}},{"$f":"'Final App Worksheet'!$I$46","v":0}]
[{"$f":"'Final App Worksheet'!$J$7","v":""},"New Construction Program","Full Cost Recovery",{"$f":"'Final App Worksheet'!$B$18","v":""},{"$f":"'Final App Worksheet'!$J$7","v":""},null,{"$f":"IF(OR('Final App Worksheet'!$J$41<>\"\",'Final App Worksheet'!$J$42<>\"\",'Final App Worksheet'!$J$43<>\"\",'Final App Worksheet'!$J$44<>\"\",'Final App Worksheet'!$J$45<>\"\"),'Final App Worksheet'!$J$39,\"\")","v":""},"Prescriptive",null,null,null,null,null,{"$f":"'Final App Worksheet'!$B$41*'Final App Worksheet'!J41+'Final App Worksheet'!$B$42*'Final App Worksheet'!J42+'Final App Worksheet'!$B$43*'Final App Worksheet'!J43+'Final App Worksheet'!$B$44*'Final App Worksheet'!J44+'Final App Worksheet'!$B$45*'Final App Worksheet'!J45","v":0},null,{"$f":"'Final App Worksheet'!$B$28","v":"00:00:00"},0,0,{"$f":"VLOOKUP(G9,'Measure Assumptions'!B:C,2,FALSE)*'Program Activity Measures EE'!N9","v":{"$error":"#N/A"}},{"$f":"VLOOKUP(G9,'Measure Assumptions'!B:D,3,FALSE)*'Program Activity Measures EE'!N9","v":{"$error":"#N/A"}},{"$f":"'Final App Worksheet'!$J$46","v":0}]
[{"$f":"'Final App Worksheet'!$J$7","v":""},"New Construction Program","Full Cost Recovery",{"$f":"'Final App Worksheet'!$B$18","v":""},{"$f":"'Final App Worksheet'!$J$7","v":""},null,{"$f":"IF(OR('Final App Worksheet'!$K$41<>\"\",'Final App Worksheet'!$K$42<>\"\",'Final App Worksheet'!$K$43<>\"\",'Final App Worksheet'!$K$44<>\"\",'Final App Worksheet'!$K$45<>\"\"),'Final App Worksheet'!$K$39,\"\")","v":""},"Prescriptive",null,null,null,null,null,{"$f":"'Final App Worksheet'!$B$41*'Final App Worksheet'!K41+'Final App Worksheet'!$B$42*'Final App Worksheet'!K42+'Final App Worksheet'!$B$43*'Final App Worksheet'!K43+'Final App Worksheet'!$B$44*'Final App Worksheet'!K44+'Final App Worksheet'!$B$45*'Final App Worksheet'!K45","v":0},null,{"$f":"'Final App Worksheet'!$B$28","v":"00:00:00"},0,0,{"$f":"VLOOKUP(G10,'Measure Assumptions'!B:C,2,FALSE)*'Program Activity Measures EE'!N10","v":{"$error":"#N/A"}},{"$f":"VLOOKUP(G10,'Measure Assumptions'!B:D,3,FALSE)*'Program Activity Measures EE'!N10","v":{"$error":"#N/A"}},{"$f":"'Final App Worksheet'!$K$46","v":0}]
{"$rows_left_out":11}
{"sheet":"Dropdown List","index":9,"n_rows":74,"n_cols":3,"rows_kept":74,"cut":false,"hidden":true,"merged":[]}
["LDC Name",null,"Do all homes included in Final Application have occupancy permits? (Y/N)"]
["Algoma Power Inc.",null,"Yes"]
["Atikokan Hydro Inc.",null,"No"]
["Attawapiskat Power Corporation"]
["Bluewater Power Distribution Corporation"]
["Brantford Power Inc."]
["Burlington Hydro Inc."]
["Canadian Niagara Power Inc."]
["Centre Wellington Hydro Ltd."]
["Chapleau Public Utilities Corporation"]
{"$rows_left_out":64}